Reaction Details
TargetNeutrophil elastase
LigandBDBM50061046
Substrate/Competitorn/a
Meas. Tech.ChEMBL_63839 (CHEMBL674889)
Ki 3.4±n/a nM
Citation Veale, CABernstein, PRBohnert, CMBrown, FJBryant, CDamewood, JREarley, RFeeney, SWEdwards, PDGomes, BHulsizer, JMKosmider, BJKrell, RDMoore, GSalcedo, TWShaw, ASilberstein, DSSteelman, GBStein, MStrimpler, AThomas, RMVacek, EPWilliams, JCWolanin, DJWoolson, S Orally active trifluoromethyl ketone inhibitors of human leukocyte elastase. J Med Chem40:3173-81 (1997) 
 
Neutrophil elastase
Name:Neutrophil elastase
Type:Enzyme
Mol. Mass.:28532.38
Organism:Homo sapiens (Human)
Description:P08246
Residue:267
BDBM50061046
NameBDBM50061046
Synonyms:CHEMBL110400 | [(S)-2,2-Difluoro-4-({(S)-1-[(S)-2-(4-methoxy-benzoylamino)-3-methyl-butyryl]-pyrrolidine-2-carbonyl}-amino)-5-methyl-3-oxo-hexyl]-carbamic acid butyl ester
TypeSmall organic molecule
Emp. Form.C30H44F2N4O7
Mol. Mass.610.6898
SMILESCCCCOC(=O)NCC(F)(F)C(=O)[C@@H](NC(=O)[C@@H]1CCCN1C(=O)[C@@H](NC(=O)c1ccc(OC)cc1)C(C)C)C(C)C