Reaction Details
TargetEndothelin receptor type B
LigandBDBM50050964
Substrate/Competitorn/a
Meas. Tech.ChEMBL_63520 (CHEMBL677268)
IC50 4.4±n/a nM
Citation Jae, HSWinn, MDixon, DBMarsh, KCNguyen, BOpgenorth, TJvon Geldern, TW Pyrrolidine-3-carboxylic acids as endothelin antagonists. 2. Sulfonamide-based ETA/ETB mixed antagonists. J Med Chem40:3217-27 (1997) 
 
Endothelin receptor type B
Name:Endothelin receptor type B
Type:Enzyme Catalytic Domain
Mol. Mass.:49664.00
Organism:Homo sapiens (Human)
Description:ENDOTHELIN B EDNRB HUMAN::P24530
Residue:442
BDBM50050964
NameBDBM50050964
Synonyms:4-[1-Benzo[1,3]dioxol-5-yl-2-(4-isopropyl-benzenesulfonylamino)-2-oxo-ethoxy]-3-propyl-benzoic acid L-754142
TypeSmall organic molecule
Emp. Form.C28H29NO8S
Mol. Mass.539.597
SMILESCCCc1cc(ccc1OC(C(=O)NS(=O)(=O)c1ccc(cc1)C(C)C)c1ccc2OCOc2c1)C(O)=O