Reaction Details
TargetEndothelin receptor type B
LigandBDBM50061078
Substrate/Competitorn/a
Meas. Tech.ChEMBL_63536 (CHEMBL677449)
IC50 0.2±n/a nM
Citation Jae, HSWinn, MDixon, DBMarsh, KCNguyen, BOpgenorth, TJvon Geldern, TW Pyrrolidine-3-carboxylic acids as endothelin antagonists. 2. Sulfonamide-based ETA/ETB mixed antagonists. J Med Chem40:3217-27 (1997) 
 
Endothelin receptor type B
Name:Endothelin receptor type B
Type:Enzyme Catalytic Domain
Mol. Mass.:49664.00
Organism:Homo sapiens (Human)
Description:ENDOTHELIN B EDNRB HUMAN::P24530
Residue:442
BDBM50061078
NameBDBM50061078
Synonyms:(2R,3R,4S)-4-Benzo[1,3]dioxol-5-yl-2-(3-fluoro-4-methoxy-phenyl)-1-{2-[propyl-(4,4,4-trifluoro-butane-1-sulfonyl)-amino]-ethyl}-pyrrolidine-3-carboxylic acid | CHEMBL419367
TypeSmall organic molecule
Emp. Form.C28H34F4N2O7S
Mol. Mass.618.637
SMILESCCCN(CCN1C[C@@H]([C@H]([C@@H]1c1ccc(OC)c(F)c1)C(O)=O)c1ccc2OCOc2c1)S(=O)(=O)CCCC(F)(F)F