Reaction Details
TargetEndothelin-1 receptor
LigandBDBM50041617
Substrate/Competitorn/a
Meas. Tech.ChEMBL_65460 (CHEMBL682100)
Ki 0.2±n/a nM
Citation Jae, HSWinn, MDixon, DBMarsh, KCNguyen, BOpgenorth, TJvon Geldern, TW Pyrrolidine-3-carboxylic acids as endothelin antagonists. 2. Sulfonamide-based ETA/ETB mixed antagonists. J Med Chem40:3217-27 (1997) 
 
Endothelin-1 receptor
Name:Endothelin-1 receptor
Type:Enzyme Catalytic Domain
Mol. Mass.:48736.88
Organism:Homo sapiens (Human)
Description:P25101
Residue:427
BDBM50041617
NameBDBM50041617
Synonyms:(1S,2R,3S)-1-Benzo[1,3]dioxol-5-yl-3-(2-carboxymethoxy-4-methoxy-phenyl)-5-propoxy-indan-2-carboxylic acid CHEMBL8823 SB-209670
TypeSmall organic molecule
Emp. Form.C29H28O9
Mol. Mass.520.5272
SMILESCCCOc1ccc2[C@@H]([C@H]([C@@H](c2c1)c1ccc(OC)cc1OCC(O)=O)C(O)=O)c1ccc2OCOc2c1