Reaction Details
TargetCannabinoid receptor 1
LigandBDBM50061108
Substrate/Competitorn/a
Meas. Tech.ChEMBL_46617 (CHEMBL658203)
EC50 0.056000±n/a nM
Citation Rhee, MHVogel, ZBarg, JBayewitch, MLevy, RHanus, LBreuer, AMechoulam, R Cannabinol derivatives: binding to cannabinoid receptors and inhibition of adenylylcyclase. J Med Chem40:3228-33 (1997) 
 
Cannabinoid receptor 1
Name:Cannabinoid receptor 1
Type:G Protein-Coupled Receptor (GPCR)
Mol. Mass.:52856.55
Organism:Rattus norvegicus (rat)
Description:P20272
Residue:473
BDBM50061108
NameBDBM50061108
Synonyms:3-(1,1-Dimethyl-heptyl)-9-hydroxymethyl-6,6-dimethyl-6H-benzo[c]chromen-1-ol | CHEMBL111724
TypeSmall organic molecule
Emp. Form.C25H34O3
Mol. Mass.382.5357
SMILESCCCCCCC(C)(C)c1cc(O)c-2c(OC(C)(C)c3ccc(CO)cc-23)c1