Reaction Details
TargetCannabinoid receptor 1
LigandBDBM50061111
Substrate/Competitorn/a
Meas. Tech.ChEMBL_46635 (CHEMBL658891)
Ki 2.6±n/a nM
Citation Rhee, MHVogel, ZBarg, JBayewitch, MLevy, RHanus, LBreuer, AMechoulam, R Cannabinol derivatives: binding to cannabinoid receptors and inhibition of adenylylcyclase. J Med Chem40:3228-33 (1997) 
 
Cannabinoid receptor 1
Name:Cannabinoid receptor 1
Type:G Protein-Coupled Receptor (GPCR)
Mol. Mass.:52856.55
Organism:Rattus norvegicus (rat)
Description:P20272
Residue:473
BDBM50061111
NameBDBM50061111
Synonyms:(R)-3-(1,1-Dimethyl-heptyl)-6,6,9-trimethyl-6a,7,8,10a-tetrahydro-6H-benzo[c]chromen-1-ol | CHEMBL111148
TypeSmall organic molecule
Emp. Form.C25H38O2
Mol. Mass.370.568
SMILESCCCCCCC(C)(C)c1cc(O)c2C3C=C(C)CC[C@H]3C(C)(C)Oc2c1