Reaction Details
TargetCannabinoid receptor 2
LigandBDBM50061108
Substrate/Competitorn/a
Meas. Tech.ChEMBL_46987 (CHEMBL658956)
Ki 0.2±n/a nM
Citation Rhee, MHVogel, ZBarg, JBayewitch, MLevy, RHanus, LBreuer, AMechoulam, R Cannabinol derivatives: binding to cannabinoid receptors and inhibition of adenylylcyclase. J Med Chem40:3228-33 (1997) 
 
Cannabinoid receptor 2
Name:Cannabinoid receptor 2
Type:G Protein-Coupled Receptor (GPCR)
Mol. Mass.:39690.94
Organism:Homo sapiens (Human)
Description:P34972
Residue:360
BDBM50061108
NameBDBM50061108
Synonyms:3-(1,1-Dimethyl-heptyl)-9-hydroxymethyl-6,6-dimethyl-6H-benzo[c]chromen-1-ol | CHEMBL111724
TypeSmall organic molecule
Emp. Form.C25H34O3
Mol. Mass.382.5357
SMILESCCCCCCC(C)(C)c1cc(O)c-2c(OC(C)(C)c3ccc(CO)cc-23)c1