Reaction Details
TargetAromatase
LigandBDBM50061156
Substrate/Competitorn/a
Meas. Tech.ChEMBL_50543 (CHEMBL660322)
Ki 10±n/a nM
Citation Akkani, APaterlini, GGleason, WBOjala, WHAbul-Hajj, YJ 6 beta-Propynyl-substituted steroids: mechanism-based enzyme-activated irreversible inhibitors of aromatase. J Med Chem40:3263-70 (1997) 
 
Aromatase
Name:Aromatase
Type:Enzyme
Mol. Mass.:57888.92
Organism:Homo sapiens (Human)
Description:P11511
Residue:503
BDBM50061156
NameBDBM50061156
Synonyms:(S)-10,13-Dimethyl-6-prop-2-ynyl-1,6,7,8,9,10,11,12,13,14,15,16-dodecahydro-2H-cyclopenta[a]phenanthrene-3,17-dione | CHEMBL113082
TypeSmall organic molecule
Emp. Form.C22H28O2
Mol. Mass.324.4565
SMILESCC12CCC3C(C[C@@H](CC#C)C4=CC(=O)CCC34C)C1CCC2=O