Reaction Details
TargetCannabinoid receptor 2
LigandBDBM50061197
Substrate/Competitorn/a
Meas. Tech.ChEMBL_47006 (CHEMBL658675)
Ki 23±n/a nM
Citation Reggio, PHWang, TBrown, AEFleming, DNSeltzman, HHGriffin, GPertwee, RGCompton, DRAbood, MEMartin, BR Importance of the C-1 substituent in classical cannabinoids to CB2 receptor selectivity: synthesis and characterization of a series of O,2-propano-delta 8-tetrahydrocannabinol analogs. J Med Chem40:3312-8 (1997) 
 
Cannabinoid receptor 2
Name:Cannabinoid receptor 2
Type:Enzyme
Mol. Mass.:39366.68
Organism:Rattus norvegicus (Rat)
Description:Q9QZN9
Residue:360
BDBM50061197
NameBDBM50061197
Synonyms:(R)-8,8-Dimethyl-5-pentyl-3,4,8,8a,9,10,12,12a-octahydro-2H-1,7-dioxa-benzo[c]phenanthren-11-one | CHEMBL109758
TypeSmall organic molecule
Emp. Form.C23H32O3
Mol. Mass.356.4984
SMILESCCCCCc1cc2OC(C)(C)[C@@H]3CCC(=O)CC3c2c2OCCCc12