Reaction Details
TargetVesicular acetylcholine transporter
LigandBDBM50039613
Substrate/Competitorn/a
Meas. Tech.ChEMBL_213558 (CHEMBL817828)
Ki 0.055000±n/a nM
Citation Efange, SMKamath, APKhare, ABKung, MPMach, RHParsons, SM N-hydroxyalkyl derivatives of 3 beta-phenyltropane and 1-methylspiro[1H-indoline-3,4'-piperidine]: vesamicol analogues with affinity for monoamine transporters. J Med Chem40:3905-14 (1998) 
 
Vesicular acetylcholine transporter
Name:Vesicular acetylcholine transporter
Type:PROTEIN
Mol. Mass.:56900.67
Organism:Homo sapiens (Human)
Description:ChEMBL_1507628
Residue:532
BDBM50039613
NameBDBM50039613
Synonyms:(2R,3R)-3-(4-Phenyl-piperidin-1-yl)-1,2,3,4-tetrahydro-naphthalen-2-ol CHEMBL87379 | trans-3-(4-phenylpiperidin-1-yl)-1,2,3,4-tetrahydronaphthalen-2-ol
TypeSmall organic molecule
Emp. Form.C21H25NO
Mol. Mass.307.4293
SMILESO[C@@H]1Cc2ccccc2C[C@H]1N1CCC(CC1)c1ccccc1