Reaction Details
TargetVesicular acetylcholine transporter
LigandBDBM50039617
Substrate/Competitorn/a
Meas. Tech.ChEMBL_213558 (CHEMBL817828)
Ki 0.360000±n/a nM
Citation Efange, SMKamath, APKhare, ABKung, MPMach, RHParsons, SM N-hydroxyalkyl derivatives of 3 beta-phenyltropane and 1-methylspiro[1H-indoline-3,4'-piperidine]: vesamicol analogues with affinity for monoamine transporters. J Med Chem40:3905-14 (1998) 
 
Vesicular acetylcholine transporter
Name:Vesicular acetylcholine transporter
Type:PROTEIN
Mol. Mass.:56900.67
Organism:Homo sapiens (Human)
Description:ChEMBL_1507628
Residue:532
BDBM50039617
NameBDBM50039617
Synonyms:1-(4-fluorobenzyl)-3-spiro[2,3-dihydro-1H-indene-1,4'-(hexahydropyridine)]-1-yl-(3R,4R)-hexahydro-4-pyridinol | CHEMBL87414
TypeSmall organic molecule
Emp. Form.C25H31FN2O
Mol. Mass.394.5248
SMILESO[C@@H]1CCN(Cc2ccc(F)cc2)C[C@H]1N1CCC2(CCc3ccccc23)CC1