Reaction Details
TargetD(2) dopamine receptor
LigandBDBM50061335
Substrate/Competitorn/a
Meas. Tech.ChEMBL_60064 (CHEMBL671378)
Ki 20±n/a nM
Citation Unangst, PCCapiris, TConnor, DTDoubleday, RHeffner, TGMacKenzie, RGMiller, SRPugsley, TAWise, LD (Aryloxy)alkylamines as selective human dopamine D4 receptor antagonists: potential antipsychotic agents. J Med Chem40:4026-9 (1998) 
 
D(2) dopamine receptor
Name:D(2) dopamine receptor
Type:Cell-surface receptors
Mol. Mass.:50647.10
Organism:Homo sapiens (Human)
Description:P14416
Residue:443
BDBM50061335
NameBDBM50061335
Synonyms:(3-Phenoxy-propyl)-(2-o-tolyloxy-ethyl)-amine | CHEMBL128313
TypeSmall organic molecule
Emp. Form.C18H23NO2
Mol. Mass.285.3807
SMILESCc1ccccc1OCCNCCCOc1ccccc1