Reaction Details
TargetD(4) dopamine receptor
LigandBDBM50061338
Substrate/Competitorn/a
Meas. Tech.ChEMBL_60661 (CHEMBL671698)
Ki 1.4±n/a nM
Citation Unangst, PCCapiris, TConnor, DTDoubleday, RHeffner, TGMacKenzie, RGMiller, SRPugsley, TAWise, LD (Aryloxy)alkylamines as selective human dopamine D4 receptor antagonists: potential antipsychotic agents. J Med Chem40:4026-9 (1998) 
 
D(4) dopamine receptor
Name:D(4) dopamine receptor
Type:Enzyme
Mol. Mass.:48373.19
Organism:Homo sapiens (Human)
Description:P21917
Residue:419
BDBM50061338
NameBDBM50061338
Synonyms:CHEMBL337627 | [2-(4-Chloro-phenoxy)-ethyl]-(3-phenylsulfanyl-propyl)-amine
TypeSmall organic molecule
Emp. Form.C17H20ClNOS
Mol. Mass.321.865
SMILESClc1ccc(OCCNCCCSc2ccccc2)cc1