Reaction Details
TargetD(4) dopamine receptor
LigandBDBM50061337
Substrate/Competitorn/a
Meas. Tech.ChEMBL_60661 (CHEMBL671698)
Ki 2.7±n/a nM
Citation Unangst, PCCapiris, TConnor, DTDoubleday, RHeffner, TGMacKenzie, RGMiller, SRPugsley, TAWise, LD (Aryloxy)alkylamines as selective human dopamine D4 receptor antagonists: potential antipsychotic agents. J Med Chem40:4026-9 (1998) 
 
D(4) dopamine receptor
Name:D(4) dopamine receptor
Type:Enzyme
Mol. Mass.:48373.19
Organism:Homo sapiens (Human)
Description:P21917
Residue:419
BDBM50061337
NameBDBM50061337
Synonyms:(2-Phenoxy-ethyl)-(3-p-tolyloxy-propyl)-amine | CHEMBL131299
TypeSmall organic molecule
Emp. Form.C18H23NO2
Mol. Mass.285.3807
SMILESCc1ccc(OCCCNCCOc2ccccc2)cc1