Reaction Details
TargetD(4) dopamine receptor
LigandBDBM50061325
Substrate/Competitorn/a
Meas. Tech.ChEMBL_60661 (CHEMBL671698)
Ki 0.96±n/a nM
Citation Unangst, PCCapiris, TConnor, DTDoubleday, RHeffner, TGMacKenzie, RGMiller, SRPugsley, TAWise, LD (Aryloxy)alkylamines as selective human dopamine D4 receptor antagonists: potential antipsychotic agents. J Med Chem40:4026-9 (1998) 
 
D(4) dopamine receptor
Name:D(4) dopamine receptor
Type:Enzyme
Mol. Mass.:48373.19
Organism:Homo sapiens (Human)
Description:P21917
Residue:419
BDBM50061325
NameBDBM50061325
Synonyms:CHEMBL131357 | [3-(4-Fluoro-phenoxy)-propyl]-(2-p-tolyloxy-ethyl)-amine
TypeSmall organic molecule
Emp. Form.C18H22FNO2
Mol. Mass.303.3712
SMILESCc1ccc(OCCNCCCOc2ccc(F)cc2)cc1