Reaction Details
TargetD(3) dopamine receptor
LigandBDBM50061333
Substrate/Competitorn/a
Meas. Tech.ChEMBL_62121 (CHEMBL673442)
Ki 17±n/a nM
Citation Unangst, PCCapiris, TConnor, DTDoubleday, RHeffner, TGMacKenzie, RGMiller, SRPugsley, TAWise, LD (Aryloxy)alkylamines as selective human dopamine D4 receptor antagonists: potential antipsychotic agents. J Med Chem40:4026-9 (1998) 
 
D(3) dopamine receptor
Name:D(3) dopamine receptor
Type:n/a
Mol. Mass.:44243.43
Organism:Homo sapiens (Human)
Description:n/a
Residue:400
BDBM50061333
NameBDBM50061333
Synonyms:(3-Phenoxy-propyl)-(3-phenyl-propyl)-amine | CHEMBL129931
TypeSmall organic molecule
Emp. Form.C18H23NO
Mol. Mass.269.3813
SMILESC(CNCCCc1ccccc1)COc1ccccc1