Reaction Details
TargetGag-Pol polyprotein [489-587]
LigandBDBM50061412
Substrate/Competitorn/a
Meas. Tech.ChEMBL_159973 (CHEMBL768120)
Ki 0.038±n/a nM
Citation Wilkerson, WWDax, SCheatham, WW Nonsymmetrically substituted cyclic urea HIV protease inhibitors. J Med Chem40:4079-88 (1998) 
 
Gag-Pol polyprotein [489-587]
Name:Gag-Pol polyprotein [489-587]
Type:Enzyme Subunit
Mol. Mass.:10781.16
Organism:Human immunodeficiency virus type 1
Description:P04585[489-587]
Residue:99
BDBM50061412
NameBDBM50061412
Synonyms:3-[(4R,5S,6S,7R)-4,7-Dibenzyl-5,6-dihydroxy-3-(3-methoxy-benzyl)-2-oxo-[1,3]diazepan-1-ylmethyl]-N-pyrazin-2-yl-benzamide | CHEMBL131508
TypeSmall organic molecule
Emp. Form.C39H39N5O5
Mol. Mass.657.7575
SMILESCOc1cccc(CN2[C@H](Cc3ccccc3)[C@H](O)[C@@H](O)[C@@H](Cc3ccccc3)N(Cc3cccc(c3)C(=O)Nc3cnccn3)C2=O)c1