Reaction Details
TargetGenome polyprotein
LigandBDBM50061538
Substrate/Competitorn/a
Meas. Tech.ChEMBL_158975 (CHEMBL763742)
IC50 2000±n/a nM
Citation Ogilvie, WBailey, MPoupart, MAAbraham, ABhavsar, ABonneau, PBordeleau, JBousquet, YChabot, CDuceppe, JSFazal, GGoulet, SGrand-Maître, CGuse, IHalmos, TLavallée, PLeach, MMalenfant, EO'Meara, JPlante, RPlouffe, CPoirier, MSoucy, FYoakim, CDéziel, R Peptidomimetic inhibitors of the human cytomegalovirus protease. J Med Chem40:4113-35 (1998) 
 
Genome polyprotein
Name:Genome polyprotein
Type:PROTEIN
Mol. Mass.:44361.04
Organism:Human rhinovirus B
Description:ChEMBL_158953
Residue:401
BDBM50061538
NameBDBM50061538
Synonyms:(S)-2-[(S)-2-((S)-2-Acetylamino-3-methyl-butyrylamino)-3-methyl-butyrylamino]-N*4*,N*4*-dimethyl-N*1*-(3,3,3-trifluoro-1-methyl-2-oxo-propyl)-succinamide | CHEMBL435000
TypeSmall organic molecule
Emp. Form.C22H36F3N5O6
Mol. Mass.523.5463
SMILESCC(C)[C@H](NC(C)=O)C(=O)N[C@@H](C(C)C)C(=O)N[C@@H](CC(=O)N(C)C)C(=O)NC(C)C(=O)C(F)(F)F