Reaction Details
TargetGenome polyprotein
LigandBDBM50061534
Substrate/Competitorn/a
Meas. Tech.ChEMBL_158975 (CHEMBL763742)
IC50 1600±n/a nM
Citation Ogilvie, WBailey, MPoupart, MAAbraham, ABhavsar, ABonneau, PBordeleau, JBousquet, YChabot, CDuceppe, JSFazal, GGoulet, SGrand-Maître, CGuse, IHalmos, TLavallée, PLeach, MMalenfant, EO'Meara, JPlante, RPlouffe, CPoirier, MSoucy, FYoakim, CDéziel, R Peptidomimetic inhibitors of the human cytomegalovirus protease. J Med Chem40:4113-35 (1998) 
 
Genome polyprotein
Name:Genome polyprotein
Type:PROTEIN
Mol. Mass.:44361.04
Organism:Human rhinovirus B
Description:ChEMBL_158953
Residue:401
BDBM50061534
NameBDBM50061534
Synonyms:4-{(S)-1-[(S)-2-Dimethylcarbamoyl-1-(3,3,3-trifluoro-1-methyl-2-oxo-propylcarbamoyl)-ethylcarbamoyl]-2,2-dimethyl-propylcarbamoyl}-butyric acid | CHEMBL134222
TypeSmall organic molecule
Emp. Form.C21H33F3N4O7
Mol. Mass.510.5045
SMILESCC(NC(=O)[C@H](CC(=O)N(C)C)NC(=O)[C@@H](NC(=O)CCCC(O)=O)C(C)(C)C)C(=O)C(F)(F)F