Reaction Details
TargetChymotrypsin-like elastase family member 2A
LigandBDBM50061509
Substrate/Competitorn/a
Meas. Tech.ChEMBL_156950 (CHEMBL762660)
IC50 200±n/a nM
Citation Ogilvie, WBailey, MPoupart, MAAbraham, ABhavsar, ABonneau, PBordeleau, JBousquet, YChabot, CDuceppe, JSFazal, GGoulet, SGrand-Maître, CGuse, IHalmos, TLavallée, PLeach, MMalenfant, EO'Meara, JPlante, RPlouffe, CPoirier, MSoucy, FYoakim, CDéziel, R Peptidomimetic inhibitors of the human cytomegalovirus protease. J Med Chem40:4113-35 (1998) 
 
Chymotrypsin-like elastase family member 2A
Name:Chymotrypsin-like elastase family member 2A
Type:PROTEIN
Mol. Mass.:28705.23
Organism:Sus scrofa
Description:ChEMBL_156951
Residue:269
BDBM50061509
NameBDBM50061509
Synonyms:(S)-2-[(S)-2-(3,3-Dimethyl-butyrylamino)-3,3-dimethyl-butyrylamino]-N*4*,N*4*-dimethyl-N*1*-[1-methyl-2-(5-methyl-benzooxazol-2-yl)-2-oxo-ethyl]-succinamide | CHEMBL133854
TypeSmall organic molecule
Emp. Form.C29H43N5O6
Mol. Mass.557.6816
SMILESCC(NC(=O)[C@H](CC(=O)N(C)C)NC(=O)[C@@H](NC(=O)CC(C)(C)C)C(C)(C)C)C(=O)c1nc2cc(C)ccc2o1