Reaction Details
TargetMelatonin receptor type 1B
LigandBDBM50061569
Substrate/Competitorn/a
Meas. Tech.ChEMBL_105269 (CHEMBL713141)
Ki 1.6±n/a nM
Citation Witt-Enderby, PAChu, GHGillen, MLLi, PK Development of a high-affinity ligand that binds irreversibly to Mel1b melatonin receptors. J Med Chem40:4195-8 (1998) 
 
Melatonin receptor type 1B
Name:Melatonin receptor type 1B
Type:Enzyme
Mol. Mass.:40203.54
Organism:Homo sapiens (Human)
Description:P49286
Residue:362
BDBM50061569
NameBDBM50061569
Synonyms:CHEMBL131919 | Chloro-acetic acid 7-methoxy-1-(2-propionylamino-ethyl)-naphthalen-2-yl ester
TypeSmall organic molecule
Emp. Form.C18H20ClNO4
Mol. Mass.349.809
SMILESCCC(=O)NCCc1c(OC(=O)CCl)ccc2ccc(OC)cc12