Reaction Details
TargetMelatonin receptor type 1A
LigandBDBM50061570
Substrate/Competitorn/a
Meas. Tech.ChEMBL_105104 (CHEMBL715948)
Ki 1.3±n/a nM
Citation Witt-Enderby, PAChu, GHGillen, MLLi, PK Development of a high-affinity ligand that binds irreversibly to Mel1b melatonin receptors. J Med Chem40:4195-8 (1998) 
 
Melatonin receptor type 1A
Name:Melatonin receptor type 1A
Type:Enzyme
Mol. Mass.:39392.94
Organism:Homo sapiens (Human)
Description:P48039
Residue:350
BDBM50061570
NameBDBM50061570
Synonyms:Bromo-acetic acid 7-methoxy-1-(2-propionylamino-ethyl)-naphthalen-2-yl ester | CHEMBL134416
TypeSmall organic molecule
Emp. Form.C18H20BrNO4
Mol. Mass.394.26
SMILESCCC(=O)NCCc1c(OC(=O)CBr)ccc2ccc(OC)cc12