Reaction Details
TargetReverse transcriptase/RNaseH
LigandBDBM10245
Substrate/Competitorn/a
Meas. Tech.ChEMBL_195843 (CHEMBL799142)
IC50 500±n/a nM
Citation Roth, TMorningstar, MLBoyer, PLHughes, SHBuckheit, RWMichejda, CJ Synthesis and biological activity of novel nonnucleoside inhibitors of HIV-1 reverse transcriptase. 2-Aryl-substituted benzimidazoles. J Med Chem40:4199-207 (1998) 
 
Reverse transcriptase/RNaseH
Name:Reverse transcriptase/RNaseH
Type:PROTEIN
Mol. Mass.:65229.15
Organism:Human immunodeficiency virus 1
Description:ChEMBL_1473730
Residue:566
BDBM10245
NameBDBM10245
Synonyms:3-(2,6-difluorophenyl)-4-thia-2,7-diazatricyclo[6.4.0.0^{2,6}]dodeca-1(12),6,8,10-tetraene NSC 625487 Thiazolobenzimidazole
TypeSmall organic molecule
Emp. Form.C15H10F2N2S
Mol. Mass.288.315
SMILESFc1cccc(F)c1C1SCc2nc3ccccc3n12