Reaction Details
TargetReverse transcriptase/RNaseH
LigandBDBM50036504
Substrate/Competitorn/a
Meas. Tech.ChEMBL_197262 (CHEMBL804178)
EC50 300±n/a nM
Citation Roth, TMorningstar, MLBoyer, PLHughes, SHBuckheit, RWMichejda, CJ Synthesis and biological activity of novel nonnucleoside inhibitors of HIV-1 reverse transcriptase. 2-Aryl-substituted benzimidazoles. J Med Chem40:4199-207 (1998) 
 
Reverse transcriptase/RNaseH
Name:Reverse transcriptase/RNaseH
Type:PROTEIN
Mol. Mass.:65229.15
Organism:Human immunodeficiency virus 1
Description:ChEMBL_1473730
Residue:566
BDBM50036504
NameBDBM50036504
Synonyms:(R-(-))-8-Methyl-6,7,8,9-tetrahydro-2H-2,7,9a-triaza-benzo[cd]azulen-1-one 8-Methyl-6,7,8,9-tetrahydro-2H-2,7,9a-triaza-benzo[cd]azulen-1-one | CHEMBL135127
TypeSmall organic molecule
Emp. Form.C11H13N3O
Mol. Mass.203.2404
SMILESCC1Cn2c3c(CN1)cccc3[nH]c2=O