Reaction Details
TargetRetinoic acid receptor RXR-alpha
LigandBDBM50061619
Substrate/Competitorn/a
Meas. Tech.ChEMBL_196488 (CHEMBL798302)
Ki 1800±n/a nM
Citation Umemiya, HFukasawa, HEbisawa, MEyrolles, LKawachi, EEisenmann, GGronemeyer, HHashimoto, YShudo, KKagechika, H Regulation of retinoidal actions by diazepinylbenzoic acids. Retinoid synergists which activate the RXR-RAR heterodimers. J Med Chem40:4222-34 (1998) 
 
Retinoic acid receptor RXR-alpha
Name:Retinoic acid receptor RXR-alpha
Type:PROTEIN
Mol. Mass.:50820.38
Organism:Homo sapiens (Human)
Description:ChEMBL_1456363
Residue:462
BDBM50061619
NameBDBM50061619
Synonyms:4-(7,7,10,10-Tetramethyl-7,8,9,10-tetrahydro-5H-13-aza-benzo[4,5]cyclohepta[1,2-b]naphthalen-12-yl)-benzoic acid | CHEMBL134834
TypeSmall organic molecule
Emp. Form.C29H29NO2
Mol. Mass.423.5461
SMILESCC1(C)CCC(C)(C)c2cc3c(Cc4ccccc4N=C3c3ccc(cc3)C(O)=O)cc12