Reaction Details
TargetReverse transcriptase/RNaseH
LigandBDBM50008330
Substrate/Competitorn/a
Meas. Tech.ChEMBL_197283 (CHEMBL804270)
EC50 7900±n/a nM
Citation Kireev, DBChrétien, JRGrierson, DSMonneret, C A 3D QSAR study of a series of HEPT analogues: the influence of conformational mobility on HIV-1 reverse transcriptase inhibition. J Med Chem40:4257-64 (1998) 
 
Reverse transcriptase/RNaseH
Name:Reverse transcriptase/RNaseH
Type:PROTEIN
Mol. Mass.:65229.15
Organism:Human immunodeficiency virus 1
Description:ChEMBL_1473730
Residue:566
BDBM50008330
NameBDBM50008330
Synonyms:3-[3-(2-Hydroxy-ethoxymethyl)-5-methyl-2,6-dioxo-1,2,3,6-tetrahydro-pyrimidin-4-ylsulfanyl]-benzoic acid methyl ester | CHEMBL16763
TypeSmall organic molecule
Emp. Form.C16H18N2O6S
Mol. Mass.366.389
SMILESCOC(=O)c1cccc(Sc2c(C)c(=O)[nH]c(=O)n2COCCO)c1