Reaction Details
TargetReverse transcriptase/RNaseH
LigandBDBM50061694
Substrate/Competitorn/a
Meas. Tech.ChEMBL_197283 (CHEMBL804270)
EC50 42±n/a nM
Citation Kireev, DBChrétien, JRGrierson, DSMonneret, C A 3D QSAR study of a series of HEPT analogues: the influence of conformational mobility on HIV-1 reverse transcriptase inhibition. J Med Chem40:4257-64 (1998) 
 
Reverse transcriptase/RNaseH
Name:Reverse transcriptase/RNaseH
Type:PROTEIN
Mol. Mass.:65229.15
Organism:Human immunodeficiency virus 1
Description:ChEMBL_1473730
Residue:566
BDBM50061694
NameBDBM50061694
Synonyms:6-Benzyl-5-isopropyl-1-aurus-1H-pyrimidine-2,4-dione | CHEMBL135367
TypeSmall organic molecule
Emp. Form.C14H15AuN2O2
Mol. Mass.440.2477
SMILESCC(C)c1c(Cc2ccccc2)n([Au])c(=O)[nH]c1=O