Reaction Details
TargetReverse transcriptase/RNaseH
LigandBDBM50008321
Substrate/Competitorn/a
Meas. Tech.ChEMBL_197283 (CHEMBL804270)
EC50 260±n/a nM
Citation Kireev, DBChrétien, JRGrierson, DSMonneret, C A 3D QSAR study of a series of HEPT analogues: the influence of conformational mobility on HIV-1 reverse transcriptase inhibition. J Med Chem40:4257-64 (1998) 
 
Reverse transcriptase/RNaseH
Name:Reverse transcriptase/RNaseH
Type:PROTEIN
Mol. Mass.:65229.15
Organism:Human immunodeficiency virus 1
Description:ChEMBL_1473730
Residue:566
BDBM50008321
NameBDBM50008321
Synonyms:6-(3,5-Dimethyl-phenylsulfanyl)-1-(2-hydroxy-ethoxymethyl)-5-methyl-1H-pyrimidine-2,4-dione | CHEMBL275599
TypeSmall organic molecule
Emp. Form.C16H20N2O4S
Mol. Mass.336.406
SMILESCc1cc(C)cc(Sc2c(C)c(=O)[nH]c(=O)n2COCCO)c1