Reaction Details
TargetReverse transcriptase/RNaseH
LigandBDBM50010998
Substrate/Competitorn/a
Meas. Tech.ChEMBL_197283 (CHEMBL804270)
EC50 8900±n/a nM
Citation Kireev, DBChrétien, JRGrierson, DSMonneret, C A 3D QSAR study of a series of HEPT analogues: the influence of conformational mobility on HIV-1 reverse transcriptase inhibition. J Med Chem40:4257-64 (1998) 
 
Reverse transcriptase/RNaseH
Name:Reverse transcriptase/RNaseH
Type:PROTEIN
Mol. Mass.:65229.15
Organism:Human immunodeficiency virus 1
Description:ChEMBL_1473730
Residue:566
BDBM50010998
NameBDBM50010998
Synonyms:1-(2-Hydroxy-ethoxymethyl)-5-methyl-6-phenoxy-1H-pyrimidine-2,4-dione | CHEMBL286769
TypeSmall organic molecule
Emp. Form.C14H16N2O5
Mol. Mass.292.2872
SMILESCc1c(Oc2ccccc2)n(COCCO)c(=O)[nH]c1=O