Reaction Details
TargetReverse transcriptase/RNaseH
LigandBDBM50032239
Substrate/Competitorn/a
Meas. Tech.ChEMBL_197283 (CHEMBL804270)
EC50 52±n/a nM
Citation Kireev, DBChrétien, JRGrierson, DSMonneret, C A 3D QSAR study of a series of HEPT analogues: the influence of conformational mobility on HIV-1 reverse transcriptase inhibition. J Med Chem40:4257-64 (1998) 
 
Reverse transcriptase/RNaseH
Name:Reverse transcriptase/RNaseH
Type:PROTEIN
Mol. Mass.:65229.15
Organism:Human immunodeficiency virus 1
Description:ChEMBL_1473730
Residue:566
BDBM50032239
NameBDBM50032239
Synonyms:6-Benzyl-5-isopropyl-1-(2-methoxy-ethyl)-1H-pyrimidine-2,4-dione | CHEMBL328140
TypeSmall organic molecule
Emp. Form.C17H22N2O3
Mol. Mass.302.3682
SMILESCOCCn1c(Cc2ccccc2)c(C(C)C)c(=O)[nH]c1=O