Reaction Details
TargetReverse transcriptase/RNaseH
LigandBDBM50061697
Substrate/Competitorn/a
Meas. Tech.ChEMBL_197283 (CHEMBL804270)
EC50 5±n/a nM
Citation Kireev, DBChrétien, JRGrierson, DSMonneret, C A 3D QSAR study of a series of HEPT analogues: the influence of conformational mobility on HIV-1 reverse transcriptase inhibition. J Med Chem40:4257-64 (1998) 
 
Reverse transcriptase/RNaseH
Name:Reverse transcriptase/RNaseH
Type:PROTEIN
Mol. Mass.:65229.15
Organism:Human immunodeficiency virus 1
Description:ChEMBL_1473730
Residue:566
BDBM50061697
NameBDBM50061697
Synonyms:6-(3,5-Dimethyl-phenylsulfanyl)-1-(2-hydroxy-ethoxymethyl)-5-isopropyl-2-thioxo-2,3-dihydro-1H-pyrimidin-4-one | CHEMBL274265
TypeSmall organic molecule
Emp. Form.C18H24N2O3S2
Mol. Mass.380.525
SMILESCC(C)c1c(Sc2cc(C)cc(C)c2)n(COCCO)c(=S)[nH]c1=O