Reaction Details
TargetReverse transcriptase/RNaseH
LigandBDBM50058299
Substrate/Competitorn/a
Meas. Tech.ChEMBL_197283 (CHEMBL804270)
EC50 100±n/a nM
Citation Kireev, DBChrétien, JRGrierson, DSMonneret, C A 3D QSAR study of a series of HEPT analogues: the influence of conformational mobility on HIV-1 reverse transcriptase inhibition. J Med Chem40:4257-64 (1998) 
 
Reverse transcriptase/RNaseH
Name:Reverse transcriptase/RNaseH
Type:PROTEIN
Mol. Mass.:65229.15
Organism:Human immunodeficiency virus 1
Description:ChEMBL_1473730
Residue:566
BDBM50058299
NameBDBM50058299
Synonyms:5-Methyl-6-phenylsulfanyl-1-((E)-3-pyridin-3-yl-allyl)-1H-pyrimidine-2,4-dione | CHEMBL56036
TypeSmall organic molecule
Emp. Form.C19H17N3O2S
Mol. Mass.351.422
SMILESCc1c(Sc2ccccc2)n(CC=Cc2cccnc2)c(=O)[nH]c1=O