Reaction Details
TargetMuscarinic acetylcholine receptor M2
LigandBDBM50061706
Substrate/Competitorn/a
Meas. Tech.ChEMBL_139633 (CHEMBL748246)
IC50 240±n/a nM
Citation Bromidge, SMBrown, FCassidy, FClark, MSDabbs, SHadley, MSHawkins, JLoudon, JMNaylor, CBOrlek, BSRiley, GJ Design of [R-(Z)]-(+)-alpha-(methoxyimino)-1-azabicyclo[2.2.2]octane-3-acetonitri le (SB 202026), a functionally selective azabicyclic muscarinic M1 agonist incorporating the N-methoxy imidoyl nitrile group as a novel ester bioisostere. J Med Chem40:4265-80 (1998) 
 
Muscarinic acetylcholine receptor M2
Name:Muscarinic acetylcholine receptor M2
Type:GPCR
Mol. Mass.:51730.61
Organism:Homo sapiens (Human)
Description:P08172
Residue:466
BDBM50061706
NameBDBM50061706
Synonyms:(1-Aza-bicyclo[2.2.1]hept-4-yl)-[(Z)-methoxyimino]-acetonitrile | CHEMBL344892
TypeSmall organic molecule
Emp. Form.C9H13N3O
Mol. Mass.179.219
SMILESCO\N=C(/C#N)C12CCN(CC1)C2