Reaction Details
TargetMuscarinic acetylcholine receptor M3
LigandBDBM50061722
Substrate/Competitorn/a
Meas. Tech.ChEMBL_138586 (CHEMBL746514)
IC50 5400±n/a nM
Citation Bromidge, SMBrown, FCassidy, FClark, MSDabbs, SHadley, MSHawkins, JLoudon, JMNaylor, CBOrlek, BSRiley, GJ Design of [R-(Z)]-(+)-alpha-(methoxyimino)-1-azabicyclo[2.2.2]octane-3-acetonitri le (SB 202026), a functionally selective azabicyclic muscarinic M1 agonist incorporating the N-methoxy imidoyl nitrile group as a novel ester bioisostere. J Med Chem40:4265-80 (1998) 
 
Muscarinic acetylcholine receptor M3
Name:Muscarinic acetylcholine receptor M3
Type:Enzyme
Mol. Mass.:66151.03
Organism:Homo sapiens (Human)
Description:P20309
Residue:590
BDBM50061722
NameBDBM50061722
Synonyms:CHEMBL341447 | [4-(3-Chloro-benzoyloxy)-but-2-ynyl]-trimethyl-ammonium
TypeSmall organic molecule
Emp. Form.C14H17ClNO2
Mol. Mass.266.743
SMILESC[N+](C)(C)CC#CCOC(=O)c1cccc(Cl)c1