Reaction Details
TargetMuscarinic acetylcholine receptor M3
LigandBDBM50061710
Substrate/Competitorn/a
Meas. Tech.ChEMBL_138586 (CHEMBL746514)
IC50 1200±n/a nM
Citation Bromidge, SMBrown, FCassidy, FClark, MSDabbs, SHadley, MSHawkins, JLoudon, JMNaylor, CBOrlek, BSRiley, GJ Design of [R-(Z)]-(+)-alpha-(methoxyimino)-1-azabicyclo[2.2.2]octane-3-acetonitri le (SB 202026), a functionally selective azabicyclic muscarinic M1 agonist incorporating the N-methoxy imidoyl nitrile group as a novel ester bioisostere. J Med Chem40:4265-80 (1998) 
 
Muscarinic acetylcholine receptor M3
Name:Muscarinic acetylcholine receptor M3
Type:Enzyme
Mol. Mass.:66151.03
Organism:Homo sapiens (Human)
Description:P20309
Residue:590
BDBM50061710
NameBDBM50061710
Synonyms:(1R,3S,4R)-1-Aza-bicyclo[2.2.1]hept-3-yl-[(Z)-methoxyimino]-acetonitrile | CHEMBL135328
TypeSmall organic molecule
Emp. Form.C9H13N3O
Mol. Mass.179.219
SMILESCO\N=C(/C#N)[C@@H]1C[N@@]2CC[C@H]1C2