Reaction Details
TargetIntegrin alpha-IIb/beta-3
LigandBDBM50061847
Substrate/Competitorn/a
Meas. Tech.ChEMBL_70319 (CHEMBL678024)
IC50 2±n/a nM
Citation Su, TNaughton, MASmyth, MSRose, JWArfsten, AEMcCowan, JRJakubowski, JAWyss, VLRuterbories, KJSall, DJScarborough, RM Fibrinogen receptor (GPIIb-IIIa) antagonists derived from 5,6-bicyclic templates. Amidinoindoles, amidinoindazoles, and amidinobenzofurans containing the N-alpha-sulfonamide carboxylic acid function as potent platelet aggregation inhibitors. J Med Chem40:4308-18 (1998) 
 
Integrin alpha-IIb/beta-3
Name:Integrin alpha-IIb/beta-3
Synonyms:Glycoprotein IIb/IIIa
Type:n/a
Mol. Mass.:n/a
Description:ASSAY_ID of EBI is 30109
Components:This complex has 2 components.
Component 1
Name:Integrin beta-3
Type:Protein
Mol. Mass.:87038.91
Organism:Homo sapiens (Human)
Description:P05106
Residue:788
Component 2
Name:Integrin alpha-IIb
Synonyms:CD_antigen=CD41 GPIIb Glycoprotein IIb ITGA2B Integrin alpha-IIb heavy chain Integrin alpha-IIb light chain, form 2 Integrin alpha-V/beta-3 and alpha-IIb/beta 3 | Platelet membrane glycoprotein IIb
Type:Protein
Mol. Mass.:113354.85
Organism:Homo sapiens (Human)
Description:P08514
Residue:1039
BDBM50061847
NameBDBM50061847
Synonyms:(S)-2-(Butane-1-sulfonylamino)-3-{3-[(5-carbamimidoyl-benzofuran-2-carbonyl)-amino]-propionylamino}-propionic acid | CHEMBL137639
TypeSmall organic molecule
Emp. Form.C20H27N5O7S
Mol. Mass.481.523
SMILESCCCCS(=O)(=O)N[C@@H](CNC(=O)CCNC(=O)c1cc2cc(ccc2o1)C(N)=N)C(O)=O