Reaction Details
TargetKynurenine 3-monooxygenase
LigandBDBM50061915
Substrate/Competitorn/a
Meas. Tech.ChEMBL_91742 (CHEMBL874146)
Ki 95±n/a nM
Citation Röver, SCesura, AMHuguenin, PKettler, RSzente, A Synthesis and biochemical evaluation of N-(4-phenylthiazol-2-yl)benzenesulfonamides as high-affinity inhibitors of kynurenine 3-hydroxylase. J Med Chem40:4378-85 (1998) 
 
Kynurenine 3-monooxygenase
Name:Kynurenine 3-monooxygenase
Type:PROTEIN
Mol. Mass.:54371.88
Organism:Rattus norvegicus
Description:ChEMBL_1487468
Residue:478
BDBM50061915
NameBDBM50061915
Synonyms:2-Amino-4-(3,4-dichloro-phenyl)-4-oxo-butyric acid CHEMBL554000
TypeSmall organic molecule
Emp. Form.C10H9Cl2NO3
Mol. Mass.262.089
SMILESNC(CC(=O)c1ccc(Cl)c(Cl)c1)C(O)=O