Reaction Details
TargetPlatelet-activating factor receptor
LigandBDBM50062127
Substrate/Competitorn/a
Meas. Tech.ChEMBL_158347 (CHEMBL768491)
Ki 2.5±n/a nM
Citation Curtin, MLDavidsen, SKHeyman, HRGarland, RBSheppard, GSFlorjancic, ASXu, LCarrera, GMSteinman, DHTrautmann, JAAlbert, DHMagoc, TJTapang, PRhein, DAConway, RGLuo, GDenissen, JFMarsh, KCMorgan, DWSummers, JB Discovery and evaluation of a series of 3-acylindole imidazopyridine platelet-activating factor antagonists. J Med Chem41:74-95 (1998) 
 
Platelet-activating factor receptor
Name:Platelet-activating factor receptor
Type:Protein
Mol. Mass.:39005.63
Organism:Cavia porcellus
Description:n/a
Residue:342
BDBM50062127
NameBDBM50062127
Synonyms:6-(4-Fluoro-phenyl)-3-[4-(2-methyl-imidazo[4,5-c]pyridin-1-ylmethyl)-piperidine-1-carbonyl]-indole-1-carboxylic acid dimethylamide | CHEMBL173642
TypeSmall organic molecule
Emp. Form.C31H31FN6O2
Mol. Mass.538.6152
SMILESCN(C)C(=O)n1cc(C(=O)N2CCC(Cn3c(C)nc4cnccc34)CC2)c2ccc(cc12)-c1ccc(F)cc1