Reaction Details
TargetPlatelet-activating factor receptor
LigandBDBM50062118
Substrate/Competitorn/a
Meas. Tech.ChEMBL_158347 (CHEMBL768491)
Ki 0.910000±n/a nM
Citation Curtin, MLDavidsen, SKHeyman, HRGarland, RBSheppard, GSFlorjancic, ASXu, LCarrera, GMSteinman, DHTrautmann, JAAlbert, DHMagoc, TJTapang, PRhein, DAConway, RGLuo, GDenissen, JFMarsh, KCMorgan, DWSummers, JB Discovery and evaluation of a series of 3-acylindole imidazopyridine platelet-activating factor antagonists. J Med Chem41:74-95 (1998) 
 
Platelet-activating factor receptor
Name:Platelet-activating factor receptor
Type:Protein
Mol. Mass.:39005.63
Organism:Cavia porcellus
Description:n/a
Residue:342
BDBM50062118
NameBDBM50062118
Synonyms:4-Ethyl-3-[4-(2-methyl-imidazo[4,5-c]pyridin-1-ylmethyl)-benzoyl]-indole-1-carboxylic acid dimethylamide | CHEMBL366553
TypeSmall organic molecule
Emp. Form.C28H27N5O2
Mol. Mass.465.5463
SMILESCCc1cccc2n(cc(C(=O)c3ccc(Cn4c(C)nc5cnccc45)cc3)c12)C(=O)N(C)C