Reaction Details
TargetPlatelet-activating factor receptor
LigandBDBM50062107
Substrate/Competitorn/a
Meas. Tech.ChEMBL_158347 (CHEMBL768491)
Ki 1.5±n/a nM
Citation Curtin, MLDavidsen, SKHeyman, HRGarland, RBSheppard, GSFlorjancic, ASXu, LCarrera, GMSteinman, DHTrautmann, JAAlbert, DHMagoc, TJTapang, PRhein, DAConway, RGLuo, GDenissen, JFMarsh, KCMorgan, DWSummers, JB Discovery and evaluation of a series of 3-acylindole imidazopyridine platelet-activating factor antagonists. J Med Chem41:74-95 (1998) 
 
Platelet-activating factor receptor
Name:Platelet-activating factor receptor
Type:Protein
Mol. Mass.:39005.63
Organism:Cavia porcellus
Description:n/a
Residue:342
BDBM50062107
NameBDBM50062107
Synonyms:1-Methylcarbamoyl-3-[4-(2-methyl-imidazo[4,5-c]pyridin-1-ylmethyl)-benzoyl]-1H-indole-4-carboxylic acid methyl ester | CHEMBL369395
TypeSmall organic molecule
Emp. Form.C27H23N5O4
Mol. Mass.481.5026
SMILESCNC(=O)n1cc(C(=O)c2ccc(Cn3c(C)nc4cnccc34)cc2)c2c(cccc12)C(=O)OC