Reaction Details
TargetPlatelet-activating factor receptor
LigandBDBM50062045
Substrate/Competitorn/a
Meas. Tech.ChEMBL_158347 (CHEMBL768491)
Ki 0.780000±n/a nM
Citation Curtin, MLDavidsen, SKHeyman, HRGarland, RBSheppard, GSFlorjancic, ASXu, LCarrera, GMSteinman, DHTrautmann, JAAlbert, DHMagoc, TJTapang, PRhein, DAConway, RGLuo, GDenissen, JFMarsh, KCMorgan, DWSummers, JB Discovery and evaluation of a series of 3-acylindole imidazopyridine platelet-activating factor antagonists. J Med Chem41:74-95 (1998) 
 
Platelet-activating factor receptor
Name:Platelet-activating factor receptor
Type:Protein
Mol. Mass.:39005.63
Organism:Cavia porcellus
Description:n/a
Residue:342
BDBM50062045
NameBDBM50062045
Synonyms:6-Benzofuran-2-yl-1-dimethylcarbamoyl-3-[4-(2-methyl-imidazo[4,5-c]pyridin-1-ylmethyl)-benzoyl]-1H-indole-4-carboxylic acid methyl ester | CHEMBL369854
TypeSmall organic molecule
Emp. Form.C36H29N5O5
Mol. Mass.611.646
SMILESCOC(=O)c1cc(cc2n(cc(C(=O)c3ccc(Cn4c(C)nc5cnccc45)cc3)c12)C(=O)N(C)C)-c1cc2ccccc2o1