Reaction Details
TargetPlatelet-activating factor receptor
LigandBDBM50062081
Substrate/Competitorn/a
Meas. Tech.ChEMBL_158347 (CHEMBL768491)
Ki 1.7±n/a nM
Citation Curtin, MLDavidsen, SKHeyman, HRGarland, RBSheppard, GSFlorjancic, ASXu, LCarrera, GMSteinman, DHTrautmann, JAAlbert, DHMagoc, TJTapang, PRhein, DAConway, RGLuo, GDenissen, JFMarsh, KCMorgan, DWSummers, JB Discovery and evaluation of a series of 3-acylindole imidazopyridine platelet-activating factor antagonists. J Med Chem41:74-95 (1998) 
 
Platelet-activating factor receptor
Name:Platelet-activating factor receptor
Type:Protein
Mol. Mass.:39005.63
Organism:Cavia porcellus
Description:n/a
Residue:342
BDBM50062081
NameBDBM50062081
Synonyms:3-[4-(2-Methyl-benzoimidazol-1-ylmethyl)-benzoyl]-1-(pyrrolidine-1-carbonyl)-1H-indole-4-carboxylic acid methyl ester | CHEMBL425688
TypeSmall organic molecule
Emp. Form.C31H28N4O4
Mol. Mass.520.5784
SMILESCOC(=O)c1cccc2n(cc(C(=O)c3ccc(Cn4c(C)nc5ccccc45)cc3)c12)C(=O)N1CCCC1