Reaction Details
TargetPlatelet-activating factor receptor
LigandBDBM50062121
Substrate/Competitorn/a
Meas. Tech.ChEMBL_158347 (CHEMBL768491)
Ki 1.8±n/a nM
Citation Curtin, MLDavidsen, SKHeyman, HRGarland, RBSheppard, GSFlorjancic, ASXu, LCarrera, GMSteinman, DHTrautmann, JAAlbert, DHMagoc, TJTapang, PRhein, DAConway, RGLuo, GDenissen, JFMarsh, KCMorgan, DWSummers, JB Discovery and evaluation of a series of 3-acylindole imidazopyridine platelet-activating factor antagonists. J Med Chem41:74-95 (1998) 
 
Platelet-activating factor receptor
Name:Platelet-activating factor receptor
Type:Protein
Mol. Mass.:39005.63
Organism:Cavia porcellus
Description:n/a
Residue:342
BDBM50062121
NameBDBM50062121
Synonyms:3-[4-(4-Chloro-2-methyl-imidazo[4,5-c]pyridin-1-ylmethyl)-benzoyl]-1-dimethylcarbamoyl-1H-indole-4-carboxylic acid methyl ester | CHEMBL354819
TypeSmall organic molecule
Emp. Form.C28H24ClN5O4
Mol. Mass.529.974
SMILESCOC(=O)c1cccc2n(cc(C(=O)c3ccc(Cn4c(C)nc5c(Cl)nccc45)cc3)c12)C(=O)N(C)C