Reaction Details
TargetPlatelet-activating factor receptor
LigandBDBM50062056
Substrate/Competitorn/a
Meas. Tech.ChEMBL_158347 (CHEMBL768491)
Ki 0.630000±n/a nM
Citation Curtin, MLDavidsen, SKHeyman, HRGarland, RBSheppard, GSFlorjancic, ASXu, LCarrera, GMSteinman, DHTrautmann, JAAlbert, DHMagoc, TJTapang, PRhein, DAConway, RGLuo, GDenissen, JFMarsh, KCMorgan, DWSummers, JB Discovery and evaluation of a series of 3-acylindole imidazopyridine platelet-activating factor antagonists. J Med Chem41:74-95 (1998) 
 
Platelet-activating factor receptor
Name:Platelet-activating factor receptor
Type:Protein
Mol. Mass.:39005.63
Organism:Cavia porcellus
Description:n/a
Residue:342
BDBM50062056
NameBDBM50062056
Synonyms:1-Dimethylcarbamoyl-3-{2-[4-(2-methyl-imidazo[4,5-c]pyridin-1-yl)-phenyl]-acetyl}-1H-indole-4-carboxylic acid methyl ester | CHEMBL172859
TypeSmall organic molecule
Emp. Form.C28H25N5O4
Mol. Mass.495.5292
SMILESCOC(=O)c1cccc2n(cc(C(=O)Cc3ccc(cc3)-n3c(C)nc4cnccc34)c12)C(=O)N(C)C