Reaction Details
TargetPlatelet-activating factor receptor
LigandBDBM50062061
Substrate/Competitorn/a
Meas. Tech.ChEMBL_158347 (CHEMBL768491)
Ki 0.670000±n/a nM
Citation Curtin, MLDavidsen, SKHeyman, HRGarland, RBSheppard, GSFlorjancic, ASXu, LCarrera, GMSteinman, DHTrautmann, JAAlbert, DHMagoc, TJTapang, PRhein, DAConway, RGLuo, GDenissen, JFMarsh, KCMorgan, DWSummers, JB Discovery and evaluation of a series of 3-acylindole imidazopyridine platelet-activating factor antagonists. J Med Chem41:74-95 (1998) 
 
Platelet-activating factor receptor
Name:Platelet-activating factor receptor
Type:Protein
Mol. Mass.:39005.63
Organism:Cavia porcellus
Description:n/a
Residue:342
BDBM50062061
NameBDBM50062061
Synonyms:1-(3,3-Dimethyl-2-oxo-butyl)-3-[4-(2-methyl-imidazo[4,5-c]pyridin-1-ylmethyl)-benzoyl]-1H-indole-4-carboxylic acid methyl ester | CHEMBL369233
TypeSmall organic molecule
Emp. Form.C31H30N4O4
Mol. Mass.522.5943
SMILESCOC(=O)c1cccc2n(CC(=O)C(C)(C)C)cc(C(=O)c3ccc(Cn4c(C)nc5cnccc45)cc3)c12