Reaction Details
TargetTrypanothione reductase
LigandBDBM79181
Substrate/Competitorn/a
Meas. Tech.ChEMBL_211973 (CHEMBL817703)
Ki 23000±n/a nM
Citation Chan, CYin, HGarforth, JMcKie, JHJaouhari, RSpeers, PDouglas, KTRock, PJYardley, VCroft, SLFairlamb, AH Phenothiazine inhibitors of trypanothione reductase as potential antitrypanosomal and antileishmanial drugs. J Med Chem41:148-56 (1998) 
 
Trypanothione reductase
Name:Trypanothione reductase
Type:Homodimer; oxidoreductase
Mol. Mass.:53868.26
Organism:Trypanosoma cruzi
Description:n/a
Residue:492
BDBM79181
NameBDBM79181
Synonyms:10-[3-(4-methyl-1-piperazinyl)propyl]-2-(trifluoromethyl)phenothiazine;hydrochloride 10-[3-(4-methylpiperazino)propyl]-2-(trifluoromethyl)phenothiazine;hydrochloride SMR000059133 TRIFLUOPERAZINE DIHYDROCHLORIDE US11542290, Compound Trifluoperazine cid_5566
TypeSmall organic molecule
Emp. Form.C21H24F3N3S
Mol. Mass.407.496
SMILESCN1CCN(CCCN2c3ccccc3Sc3ccc(cc23)C(F)(F)F)CC1