Reaction Details
Target5-hydroxytryptamine receptor 1A
LigandBDBM50062264
Substrate/Competitorn/a
Meas. Tech.ChEMBL_1210 (CHEMBL615976)
Ki 9.3±n/a nM
Citation Zhuang, ZPKung, MPMu, MKung, HF Isoindol-1-one analogues of 4-(2'-methoxyphenyl)-1-[2'-[N-(2"-pyridyl)-p-iodobenzamido]ethyl]pipera zine (p-MPPI) as 5-HT1A receptor ligands. J Med Chem41:157-66 (1998) 
 
5-hydroxytryptamine receptor 1A
Name:5-hydroxytryptamine receptor 1A
Type:G Protein-Coupled Receptor (GPCR)
Mol. Mass.:46445.29
Organism:Rattus norvegicus (rat)
Description:Binding assays were performed using rat hippocampal membranes.
Residue:422
BDBM50062264
NameBDBM50062264
Synonyms:3-Hydroxy-6-iodo-2-{2-[4-(2-methoxy-5-nitro-phenyl)-piperazin-1-yl]-ethyl}-3-phenyl-2,3-dihydro-isoindol-1-one | CHEMBL290430
TypeSmall organic molecule
Emp. Form.C27H27IN4O5
Mol. Mass.614.4316
SMILESCOc1ccc(cc1N1CCN(CCN2C(=O)c3cc(I)ccc3C2(O)c2ccccc2)CC1)[N+]([O-])=O