Reaction Details
Target5-hydroxytryptamine receptor 1A
LigandBDBM50035508
Substrate/Competitorn/a
Meas. Tech.ChEMBL_1210 (CHEMBL615976)
Ki 0.2±n/a nM
Citation Zhuang, ZPKung, MPMu, MKung, HF Isoindol-1-one analogues of 4-(2'-methoxyphenyl)-1-[2'-[N-(2"-pyridyl)-p-iodobenzamido]ethyl]pipera zine (p-MPPI) as 5-HT1A receptor ligands. J Med Chem41:157-66 (1998) 
 
5-hydroxytryptamine receptor 1A
Name:5-hydroxytryptamine receptor 1A
Type:G Protein-Coupled Receptor (GPCR)
Mol. Mass.:46445.29
Organism:Rattus norvegicus (rat)
Description:Binding assays were performed using rat hippocampal membranes.
Residue:422
BDBM50035508
NameBDBM50035508
Synonyms:4-Iodo-N-{2-[4-(2-methoxy-phenyl)-piperazin-1-yl]-ethyl}-N-pyridin-2-yl-benzamide p-MPPI
TypeSmall organic molecule
Emp. Form.C25H27IN4O2
Mol. Mass.542.4119
SMILESCOc1ccccc1N1CCN(CCN(C(=O)c2ccc(I)cc2)c2ccccn2)CC1