Reaction Details
Target72 kDa type IV collagenase
LigandBDBM50062304
Substrate/Competitorn/a
Meas. Tech.ChEMBL_104542 (CHEMBL718929)
Ki 0.21±n/a nM
Citation Levy, DELapierre, FLiang, WYe, WLange, CWLi, XGrobelny, DCasabonne, MTyrrell, DHolme, KNadzan, AGalardy, RE Matrix metalloproteinase inhibitors: a structure-activity study. J Med Chem41:199-223 (1998) 
 
72 kDa type IV collagenase
Name:72 kDa type IV collagenase
Type:Enzyme
Mol. Mass.:73870.36
Organism:Homo sapiens (Human)
Description: P08253
Residue:660
BDBM50062304
NameBDBM50062304
Synonyms:(R)-2-Hexyl-N*4*-hydroxy-N*1*-[(S)-2-(1H-indol-3-yl)-1-methylcarbamoyl-ethyl]-succinamide | CHEMBL71482
TypeSmall organic molecule
Emp. Form.C22H32N4O4
Mol. Mass.416.5139
SMILESCCCCCC[C@H](CC(=O)NO)C(=O)N[C@@H](Cc1c[nH]c2ccccc12)C(=O)NC