Reaction Details
Target72 kDa type IV collagenase
LigandBDBM50062294
Substrate/Competitorn/a
Meas. Tech.ChEMBL_104542 (CHEMBL718929)
Ki 0.54±n/a nM
Citation Levy, DELapierre, FLiang, WYe, WLange, CWLi, XGrobelny, DCasabonne, MTyrrell, DHolme, KNadzan, AGalardy, RE Matrix metalloproteinase inhibitors: a structure-activity study. J Med Chem41:199-223 (1998) 
 
72 kDa type IV collagenase
Name:72 kDa type IV collagenase
Type:Enzyme
Mol. Mass.:73870.36
Organism:Homo sapiens (Human)
Description: P08253
Residue:660
BDBM50062294
NameBDBM50062294
Synonyms:(R)-N*4*-Hydroxy-N*1*-{(S)-2-(1H-indol-3-yl)-1-[(pyridin-2-ylmethyl)-carbamoyl]-ethyl}-2-isobutyl-succinamide | CHEMBL70965
TypeSmall organic molecule
Emp. Form.C25H31N5O4
Mol. Mass.465.5447
SMILESCC(C)C[C@H](CC(=O)NO)C(=O)N[C@@H](Cc1c[nH]c2ccccc12)C(=O)NCc1ccccn1